﻿id	summary	reporter	owner	description	type	status	priority	milestone	component	version	resolution	keywords	cc	launchpad_bug
1341	Setuptools test_check_requirement failure, Changeset 4994	killyourtv	somebody	"Sorry, I'm back again. 

After applying the patch in changeset:4994, the tests fail with the following output:


{{{
===============================================================================
[ERROR]: allmydata.test.test_version.CheckRequirement.test_check_requirement

Traceback (most recent call last):
  File ""/build/$USERNAME-tahoe-lafs_1.8.2~beta1-2-amd64-ZHbyMn/tahoe-lafs-1.8.2~beta1/src/allmydata/test/test_version.py"", line 12, in test_check_requirement
    check_requirement(""setuptools >= 0.6c6"", {""setuptools"": (""0.6"", """")})
  File ""/build/$USERNAME-tahoe-lafs_1.8.2~beta1-2-amd64-ZHbyMn/tahoe-lafs-1.8.2~beta1/src/allmydata/__init__.py"", line 214, in check_requirement
    (actual, location, comment) = vers_and_locs[name]
exceptions.ValueError: need more than 2 values to unpack
-------------------------------------------------------------------------------
Ran 839 tests in 521.128s

FAILED (skips=17, expectedFailures=3, errors=1, successes=818)
}}}

"	defect	closed	major	1.8.2	code	1.8.1	duplicate	setuptools		
